{"text_format":"1","workbook":"xlsx","n_sheets":7,"sheets":["Form","Narrative Sheet","Funding","ref","ImportToDB","Index Parameters","BridgeTableNew"],"not_rendered":{"charts":0,"images":0,"macros":1,"external_links":0,"defined_names":1,"comments":0,"pivot_tables":0},"unopened":[],"bounds":{"document_bytes":16777216,"sheet_cells":100000,"rows_first":2000,"rows_last":500,"rows_between":2000,"halvings":0,"cell_chars":16384,"cell_head_chars":4096},"cells_cut":0,"cells_raw":0,"read":"whole","date_system":"1900"}

{"sheet":"Form","index":0,"n_rows":77,"n_cols":9,"rows_kept":77,"cut":false,"hidden":false,"merged":[[75,1,75,8],[76,1,76,8],[52,0,67,8],[5,1,5,5],[7,1,7,5],[9,1,9,3],[32,0,32,8],[13,4,13,6],[11,1,11,3],[11,5,11,7],[51,0,51,8],[70,0,70,8],[71,0,71,8],[72,1,72,8],[73,1,73,8],[74,1,74,8],[0,0,0,8],[50,0,50,8],[3,1,3,2],[3,4,3,7],[33,0,48,8],[1,2,1,4],[1,0,1,1]]}
["UCTC STP-OFF SYSTEM BRIDGE BLOCK PROGRAM DATA FORM"]
["Project Sponsor"]
[]
["First Name",null,null,"Last Name"]
[]
["Address 1"]
[]
["Address 2"]
[]
["City",null,null,null,"State:  NY",null,"Zip Code"]
[]
["email",null,null,null,"phone"]
[]
["County",{"$f":"VLOOKUP($B$16,BridgeTableNew!$A$2:$U$243,3,FALSE)","v":"Ulster"},null,null,"Project Priority"]
[]
["BIN","2224530",null,"Feature Carried",{"$f":"VLOOKUP($B$16,BridgeTableNew!$A$2:$U$243,6,FALSE)","v":"DRUMMOND FALLS RD"}]
["Related PIN",null,null,"Feature Crossed",{"$f":"VLOOKUP($B$16,BridgeTableNew!$A$2:$T$243,7,FALSE)","v":"KAATERSKILL CREEK"}]
[null,null,null,"Owner",{"$f":"VLOOKUP($B$16,BridgeTableNew!$A$2:$U$243,4,FALSE)","v":"40 - Town"},null,"Region",{"$f":"VLOOKUP($B$16,BridgeTableNew!$A$2:$U$243,2,FALSE)","v":"8"}]
["STP Off",{"$f":"IF(VLOOKUP(Form!$E$19,ref!A67:C80,3,FALSE) = \"On\", \"Ineligible\", \"Eligible\")","v":"Eligible"},null,"Functional Class",{"$f":"VLOOKUP($B$16,BridgeTableNew!$A$2:$AA$243,27,FALSE)","v":"09"}]
[]
["Facility Importance",null,null,"Cost & Schedule",null,null,"Risk & Restrictions"]
["AADT",{"$f":"VLOOKUP($B$16,BridgeTableNew!$A$2:$U$243,8,FALSE)","v":285},null,"Const. Cost",null,null,"Posting",null,{"$f":"VLOOKUP($B$16,BridgeTableNew!$A$2:$U$243,16,FALSE)","v":10}]
["% Trucks",{"$f":"VLOOKUP($B$16,BridgeTableNew!$A$2:$U$243,9,FALSE)","v":4.91},null,"Total Cost",null,null,"Hyd. Vuln. Rating",null,{"$f":"VLOOKUP($B$16,BridgeTableNew!$A$2:$U$243,17,FALSE)","v":"4"}]
["Detour (mi)",{"$f":"VLOOKUP($B$16,BridgeTableNew!$A$2:$U$243,10,FALSE)","v":1},null,"SFY Letting",null,null,"Fracture Critical",null,{"$f":"IF(F25=\"N\",\"No\",\"Yes\")","v":"Yes"}]
[null,null,null,null,null,{"$f":"VLOOKUP($B$16,BridgeTableNew!$A$2:$U$243,18,FALSE)","v":"Y"},"Design Type",null,{"$f":"VLOOKUP($F$26,ref!$A$1:$B$45,2,FALSE)","v":"Multi Girder Rolled Beam"}]
["Structure Details",null,null,"Capital Need",null,{"$f":"VLOOKUP($B$16,BridgeTableNew!$A$2:$U$243,19,FALSE)","v":"09"},"Material Type",null,{"$f":"VLOOKUP($F$27,ref!A47:B63,2,FALSE)","v":"Steel"}]
["Year Built",{"$f":"VLOOKUP($B$16,BridgeTableNew!$A$2:$U$243,11,FALSE)","v":1884},null,"Condition Rating",{"$f":"VLOOKUP($B$16,BridgeTableNew!$A$2:$AA$243,24,FALSE)","v":4.0220000000000002},{"$f":"VLOOKUP($B$16,BridgeTableNew!$A$2:$U$243,20,FALSE)","v":"1"}]
["Deck Area",{"$f":"VLOOKUP($B$16,BridgeTableNew!$A$2:$U$243,12,FALSE)","v":798},null,"Rating Date",{"$f":"VLOOKUP($B$16,BridgeTableNew!$A$2:$AA$243,25,FALSE)","v":"2019-07-16"},{"$f":"VLOOKUP($B$16,BridgeTableNew!$A$2:$U$243,14,FALSE)","v":"Y"}]
[null,null,null,"General Rating",{"$f":"VLOOKUP($B$16,BridgeTableNew!$A$2:$AS$243,28,FALSE)","v":4}]
[null,null,null,"Structural Deficient '18",{"$f":"IF(F28=\"N\",\"No\",\"Yes\")","v":"Yes"},null,"LBPI '18",{"$f":"VLOOKUP($B$16,BridgeTableNew!$A$2:$U$243,21,FALSE)","v":0.437}]
{"$rows_left_out":48}
{"sheet":"Narrative Sheet","index":1,"n_rows":35,"n_cols":2,"rows_kept":35,"cut":false,"hidden":false,"merged":[[28,0,28,8],[23,0,26,8],[29,0,32,8],[34,0,34,8],[35,0,38,8],[22,0,22,8],[0,0,3,8],[5,0,5,8],[10,0,13,8],[15,0,18,8],[20,0,20,8]]}
["Beyond Preservation Project Review \nNARRATIVE SHEET\n"]
[]
[]
[]
[]
["Section A: Project Description"]
[]
["BIN",{"$f":"Form!B16","v":"2224530"}]
[]
["Project Scope"]
[]
[]
[]
[]
["Project Objective"]
[]
[]
[]
[]
[]
["Section B: Project Context"]
[]
["1.)  Describe how the proposed project provides critical links to the area the project serves (examples are multi-modal connections, large residential areas, emergency routes, freight routes, employment centers etc).  Discuss type and magnitude of link."]
[]
[]
[]
[]
[]
["2.) How was the need for the project identified? Was the project derived from a local bridge work program, a planning/engineering study, part of an overall plan, or part of an existing capital plan? Other source? Provide a copy or web link to the related planning/engineering studies or other planning work as part of this application"]
[]
{"$rows_left_out":6}
{"sheet":"Funding","index":2,"n_rows":38,"n_cols":6,"rows_kept":38,"cut":false,"hidden":false,"merged":[[0,0,0,5],[20,0,20,3],[21,0,21,3],[22,0,22,3],[23,0,23,3],[2,0,2,5],[31,0,31,3],[19,0,19,5],[26,0,26,5],[27,0,27,3],[29,0,29,3],[28,0,28,3],[30,0,30,3]]}
["UCTC STP-OFF SYSTEM BRIDGE BLOCK PROGRAM FUNDING WORKSHEET"]
[]
["Element Cost Estimates"]
["Element","Unit","Unit Price","Quantity","Total Cost","Estimate source"]
["eg 5' wide sidewalk ","LF",74,20,{"$f":"C5*D5","v":1480},"NYSDOT Item Numbers: 608.0101 - CONCRETE SIDEWALKS AND DRIVEWAYS203.02 - UNCLASSIFIED EXCAVATION AND DISPOSAL 304.12 - SUBBASE COURSE TYPE 2"]
[null,null,null,null,{"$f":"C6*D6","v":0}]
[null,null,null,null,0]
[null,null,null,null,0]
[null,null,null,null,0]
[null,null,null,null,0]
[null,null,null,null,0]
[null,null,null,null,0]
[null,null,null,null,0]
[null,null,null,null,0]
[null,null,null,null,0]
[null,null,null,null,0]
[null,null,null,null,0]
[null,null,null,null,0]
[]
["Estimated Total Project Costs"]
["Construction Costs (in 2020 $)",null,null,null,{"$f":"SUM(E6:E18)","v":0}]
["Inspection Cost/Contingency (10% of construction cost)"]
["All Design Phases:"]
["Total Project Cost:",null,null,null,{"$f":"SUM(E21:E23)","v":0}]
[]
[]
["Funding Sources"]
["Federal Funds Requested + Required 20% Local Match*"]
["Additional Local Funds Beyond the Required Match**"]
["Funds for Other Sources Beyond the Required Match **"]
{"$rows_left_out":9}
{"sheet":"ref","index":3,"n_rows":80,"n_cols":3,"rows_kept":80,"cut":false,"hidden":true,"merged":[]}
["Design Types"]
["01","Slab"]
["02","Slab, Voided"]
["03","Box, Adjacent"]
["04","Box, Spread"]
["05","Tee Beam"]
["06","Prestressed Conc I-Beam"]
["07","Prestr Conc Box Channel"]
["08","Segmental Box"]
["09","Multi Girder Rolled Beam"]
["10","Deck w/Floorbeam"]
["11","Thru w/Floorbeam"]
["12","Jack Arch Rolled Beam"]
["13","Multi Girder Plate Girder"]
["14","Deck w/Floorbeam"]
["15","Thru w/Floorbeam"]
["16","Jack Arch Plate Girder"]
["17","Deck Truss"]
["18","Thru Truss w/Ovh Bracing"]
["19","Thru Truss no Ovh Bracing"]
["20","Combination Truss"]
["21","Kit Bridge Truss"]
["22","Thru Arch"]
["23","Tied Thru Arch"]
["24","Deck Arch Open Spandrel"]
["25","Deck Arch Clsed Spandrel"]
["26","Metal Pipe Arch"]
["27","Frame"]
["28","Frame w/Floorbeam"]
["29","Movable, Bascule"]
{"$rows_left_out":51}
{"sheet":"ImportToDB","index":4,"n_rows":2,"n_cols":17,"rows_kept":2,"cut":false,"hidden":true,"merged":[]}
["BIN","PIN","Const Cost","Total Cost","SFY Letting","First Name","Last Name","Address 1","Address 2","City","Zip Code","Project Priority","Project Scope Description","Project Commentary","Project Sponsor","email","phone"]
[{"$f":"Form!B16","v":"2224530"},{"$f":"Form!B17","v":0},{"$f":"Form!E22","v":0},{"$f":"Form!E23","v":0},{"$f":"Form!E24","v":0},{"$f":"Form!B4","v":0},{"$f":"Form!E4","v":0},{"$f":"Form!B6","v":0},{"$f":"Form!B8","v":0},{"$f":"Form!B10","v":0},{"$f":"Form!H10","v":0},{"$f":"Form!H14","v":0},{"$f":"Form!A34","v":0},{"$f":"Form!A53","v":0},{"$f":"Form!C2","v":0},{"$f":"Form!B12","v":0},{"$f":"Form!F12","v":0}]

{"sheet":"Index Parameters","index":5,"n_rows":11,"n_cols":4,"rows_kept":11,"cut":false,"hidden":false,"merged":[[10,0,10,2],[0,0,0,3],[2,1,3,1],[4,1,6,1],[8,1,9,1],[4,0,6,0],[2,0,3,0],[8,0,9,0]]}
["Ulster County Local Bridge Priority Index \n(0-75)"]
["Category","Category Points","Individual Parameter","Parameter Points"]
["Capital Need",32.5,"General Recommendation",27.5]
[null,null,"Structural Deficiency",5]
["Facility Importance",27.5,"AADT",7]
[null,null,"% Trucks",7]
[null,null,"Detour Length",13.5]
["Restrictions",5,"Postings",5]
["Risk/Resiliency",10,"Fracture Critical",5]
[null,null,"Hydraulic Vulnerability",5]
["Total",null,null,{"$f":"SUM(D3:D10)","v":75}]

{"sheet":"BridgeTableNew","index":6,"n_rows":243,"n_cols":45,"rows_kept":243,"cut":false,"hidden":true,"merged":[]}
[null,null,null,null,null,null,null,null,null,null,null,null,null,null,null,null,null,null,null,null,null,null,null,null,null,null,null,null,null,27.5,null,null,null,5,7,7,13.5,5,5,5,null,null,null,{"$f":"SUM(AD1:AN1)","v":75},"out of 1"]
["BIN","REGION","County Name","PRIMARY_OWNER","PRIMARY_OWNER_ID","CARRIED","CROSSED","AADT","DAILY TRUCK TRAFFIC (%)","DETOUR LENGTH (MI)","YEAR BUILT","DECK AREA (SQ FT)","CONDITION RATING","STRUCTRUALLY DEFICIENT","currentwork","POSTED LOAD (TONS)","HYDRAULIC RATING","FRACTURE CRITICAL","DESIGN TYPE","MATERIAL","LBPI","NBI","NBI BIN","NYSDOT CON RATE","NYSDOT CR DATE","Most recent Con","FC","general rec","gen con","Gen con score","actual cond percentile","Gen percentile","nbi sd","SD score","AADT Score","Truck Score","detour score rev","posted score rev","Fracture score","Hydro vuln Score","detour len comp","posted comp",null,"Total Score","UCLBPI"]
["2019580","8","Ulster","42 - City","42","GREENKILL AVENUE","BROADWAY RTE 28 ",3033,1.26,0,1952,2900,3.4060000000000001,"N","cyclical",98,"","Y","15","1",0.45700000000000002,"9","Good",6.5830000000000002,"2019-09-03",6.5830000000000002,"17",7,7,{"$f":"27.5-(AC3*(27.5/7))","v":0},{"$f":"IF(Z3>0,27.5-(_xlfn.PERCENTRANK.EXC(Z:Z,Z3))/(1/27.5),\"\")","v":1.4849999999999994},{"$f":"IF(AC3>0,(27.5-(_xlfn.PERCENTRANK.INC(AC:AC,AC3))/(1/27.5)),\"\")","v":1.6224999999999987},{"$f":"IF(W3=\"Poor\", \"Y\", \"N\")","v":"N"},{"$f":"_xlfn.IFNA((IF(AG3=\"N\",0,5)),\"\")","v":0},{"$f":"_xlfn.IFNA((_xlfn.PERCENTRANK.INC(H:H,H3))/(1/7),\"\")","v":6.5730000000000004},{"$f":"(_xlfn.PERCENTRANK.INC(I:I,I3))/(1/7)","v":0.434},{"$f":"IF(J3=99,13.5,(_xlfn.PERCENTRANK.INC(AO:AO,AO3))/(1/12.5))","v":0},{"$f":"IF(OR(P3=0,P3>97),0,(5-(_xlfn.PERCENTRANK.EXC(AP:AP,AP3))/(1/5)))","v":0},{"$f":"IF(R3=\"Y\",5,0)","v":5},{"$f":"IFERROR((Q3-1),0)","v":0},{"$f":"IF(J3=99,\"\",J3)","v":0},{"$f":"IF(OR(P3=0,P3>97),\"\",P3)","v":""},null,{"$f":"SUM(AN3,AM3,AL3,AK3,AJ3,AI3,AH3,AD3)","v":12.007000000000001},{"$f":"AR3/75","v":0.16009333333333337}]
["2224200","8","Ulster","40 - Town","40","BALACE ROAD     ","RONDOUT CREEK   ",16,4.91,99,2006,1206,6.7229999999999999,"N","cyclical",0,"5","N","03","E",0.13700000000000001,"7","Good",6.4290000000000003,"2018-10-24",6.4290000000000003,"09",6,6,3.9285714285714306,{"$f":"IF(Z4>0,27.5-(_xlfn.PERCENTRANK.EXC(Z:Z,Z4))/(1/27.5),\"\")","v":2.7499999999999964},6.1049999999999969,"N",0,0.45500000000000002,1.9809999999999999,13.5,0,0,4,"","",null,23.864571428571431,{"$f":"AR4/75","v":0.31819428571428576}]
["2224210","8","Ulster","40 - Town","40","CLOVE ROAD      ","COXING KILL     ",228,4.91,6,1930,691,3.4910000000000001,"Y","replace",12,"2","N","21","1",0.56000000000000005,"3","Poor",3.6669999999999998,"2019-04-11",3.6669999999999998,"09",3,3,15.714285714285715,24.1175,27.06,"Y",5,3.367,1.9809999999999999,8.85,3.5300000000000002,0,1,6,12,null,39.442285714285717,0.52589714285714284]
["2224220","8","Ulster","40 - Town","40","CLOVE ROAD","COXING KILL     ",228,4.91,6,1988,690,4.5430000000000001,"N","majorrehab",0,"4","N","27","B",0.25800000000000001,"6","Fair",4.3849999999999998,"2018-04-20",4.3849999999999998,"09",5,5,7.8571428571428577,17.9575,17.16,"N",0,3.367,1.9809999999999999,8.85,0,0,3,6,"",null,25.055142857142858,0.33406857142857144]
["2224230","8","Ulster","40 - Town","40","BARNHART RD     ","BEAVER KILL     ",52,3.85,99,1895,1170,5.3609999999999998,"N","cyclical",0,"4","Y","09","1",0.11799999999999999,"5","Fair",5,"2018-11-01",5,"09",5,5,7.8571428571428577,12.182499999999997,17.16,"N",0,1.274,0.90300000000000002,13.5,0,5,3,"","",null,31.534142857142857,0.4204552380952381]
["2224240","8","Ulster","40 - Town","40","MILL BROOK ROAD ","MILL BROOK      ",42,10.53,2,1933,750,4.1230000000000002,"Y","majorrehab",0,"3","N","09","2",0.36099999999999999,"4","Poor",3.9470000000000001,"2019-04-01",3.9470000000000001,"09",3,3,15.714285714285715,21.477499999999999,27.06,"Y",5,1.0780000000000001,6.8530000000000006,4.8125,0,0,2,2,"",null,35.45778571428572,0.47277047619047624]
["2224250","8","Ulster","40 - Town","40","MILL BROOK ROAD","BELLE AYR BROOK ",42,10.53,25,1926,405,3.0979999999999999,"Y","replace",0,"4","N","12","1",0.53300000000000003,"3","Poor",7,"2019-10-11",7,"09",7,7,0,0.35749999999999815,1.6224999999999987,"N",0,1.0780000000000001,6.8530000000000006,11.7125,0,0,3,25,"",null,22.6435,0.30191333333333331]
["2224260","8","Ulster","40 - Town","40","MILL BROOK ROAD ","MILL BROOK",42,10.53,15,2000,444,5.6669999999999998,"N","cyclical",0,"5","N","40","B",5.2999999999999999E-2,"6","Fair",5,"2018-10-11",5,"09",5,5,7.8571428571428577,12.182499999999997,17.16,{"$f":"IF(W10=\"Poor\", \"Y\", \"N\")","v":"N"},0,1.0780000000000001,6.8530000000000006,11.1875,0,0,4,15,"",null,30.975642857142859,0.41300857142857145]
["2224300","8","Ulster","40 - Town","40","OLD ROUTE 209   ","KRIPPLEBUSH CREEK",null,1,1,1927,900,3.5710000000000002,"Y","majorrehab",0,"4","N","01","B",0.41799999999999998,"4","Poor",3.1429999999999998,"2019-06-14",3.1429999999999998,"09",4,4,11.785714285714286,26.1525,24.75,"Y",5,"",0.25900000000000001,0.77500000000000002,0,0,3,1,"",null,20.819714285714284,0.27759619047619044]
["2224430","8","Ulster","40 - Town","40","MILL HOOK ROAD  ","MILL STREAM",69,4.91,1,1948,500,4.1929999999999996,"Y","majorrehab",14,"3","N","09","1",0.40400000000000003,"4","Poor",3.6920000000000002,"2019-11-07",3.6920000000000002,"09",3,3,15.714285714285715,23.759999999999998,27.06,"Y",5,1.6310000000000002,1.9809999999999999,0.77500000000000002,3.24,0,2,1,14,null,30.341285714285718,0.40455047619047624]
["2224440","8","Ulster","40 - Town","40","STONY KILL ROAD ","STONY KILL      ",301,4.91,1,1988,1196,5.2629999999999999,"N","deckrepl",0,"5","N","09","1",0.02,"5","Fair",5.7309999999999999,"2019-03-28",5.7309999999999999,"09",5,5,7.8571428571428577,6.379999999999999,17.16,"N",0,3.8570000000000007,1.9809999999999999,0.77500000000000002,0,0,4,1,"",null,18.470142857142861,0.24626857142857148]
["2224450","8","Ulster","40 - Town","40","BRIDGE ROAD     ","STONY KILL      ",36,3.92,1,1955,664,3.577,"Y","majorrehab",20,"2","N","09","1",0.502,"4","Poor",3.577,"2019-04-24",3.577,"19",3,3,15.714285714285715,24.6675,27.06,"Y",5,0.88200000000000001,0.95900000000000007,0.77500000000000002,1.3250000000000002,0,1,1,20,null,25.655285714285714,0.3420704761904762]
["2224460","8","Ulster","40 - Town","40","BOICE MILL ROAD ","FALLS MILL BROOK",149,4.91,1,1988,1000,2.9649999999999999,"Y","majorrehab",13,"4","N","09","1",0.54400000000000004,"4","Poor",2.93,"2019-04-25",2.93,"09",3,3,15.714285714285715,26.482500000000002,27.06,"Y",{"$f":"_xlfn.IFNA((IF(AG15=\"N\",0,5)),\"\")","v":5},2.6110000000000002,1.9809999999999999,0.77500000000000002,3.3849999999999998,0,3,1,13,null,32.466285714285718,0.43288380952380956]
["2224470","8","Ulster","40 - Town","40","WATER FALLS ROAD","MOMBACCUS CREEK ",54,7.41,2,1955,725,4.0350000000000001,"N","majorrehab",0,"4","N","09","1",0.30399999999999999,"4","Poor",3.6840000000000002,"2019-04-09",3.6840000000000002,"09",4,4,11.785714285714286,23.87,24.75,"Y",5,1.302,6.3840000000000003,4.8125,0,0,3,2,"",null,32.284214285714285,0.43045619047619044]
["2224480","8","Ulster","40 - Town","40","SUNDOWN ROAD    ","WYNCOOP CREEK",202,4.91,2,1962,518,4.5439999999999996,"N","majorrehab",0,"2","N","09","1",0.27300000000000002,"4","Poor",4.0529999999999999,"2019-08-20",4.0529999999999999,"09",4,4,11.785714285714286,20.7075,24.75,"Y",5,3.1010000000000004,1.9809999999999999,4.8125,0,0,1,2,"",null,27.680214285714285,0.36906952380952379]
["2224510","8","Ulster","40 - Town","40","ROCK HILL ROAD  ","PETERS KILL     ",41,4.91,3,2011,807,5.2809999999999997,"N","vertdown",0,"4","N","09","1",2.1999999999999999E-2,"7","Good",4.9820000000000002,"2019-10-01",4.9820000000000002,"09",5,5,7.8571428571428577,12.292499999999999,17.16,"N",0,1.0429999999999999,1.9809999999999999,6.4375,0,0,3,3,"",null,20.318642857142855,0.27091523809523804]
["2224520","8","Ulster","40 - Town","40","PROJECT 32 ROAD ","STONY KILL      ",64,4.91,2,1955,853,3.9620000000000002,"Y","majorrehab",19,"4","Y","09","1",0.41299999999999998,"5","Fair",3.86,"2019-04-24",3.86,"09",4,4,11.785714285714286,22.7425,24.75,"N",0,1.47,1.9809999999999999,4.8125,1.4750000000000005,5,3,2,19,null,29.524214285714287,0.39365619047619049]
["2224530","8","Ulster","40 - Town","40","DRUMMOND FALLS RD","KAATERSKILL CREEK",285,4.91,1,1884,798,4.149,"Y","majorrehab",10,"4","Y","09","1",0.437,"4","Poor",4.0220000000000002,"2019-07-16",4.0220000000000002,"09",4,4,11.785714285714286,20.817499999999999,24.75,"Y",5,3.7940000000000005,1.9809999999999999,0.77500000000000002,3.9750000000000001,5,3,1,10,null,35.310714285714283,0.47080952380952379]
["2224540","8","Ulster","40 - Town","40","CHARLES SMITH RD","KAATERSKILL CREEK",235,4.91,3,1985,2616,5.476,"N","cyclical",0,"5","N","13","1",2.4E-2,"7","Good",5.7140000000000004,"2019-05-30",5.7140000000000004,"09",5,5,7.8571428571428577,6.5999999999999979,17.16,"N",0,3.5,1.9809999999999999,6.4375,0,0,4,3,"",null,23.775642857142856,0.31700857142857142]
["2224560","8","Ulster","40 - Town","40","SILVER HOLLOW RD","STONY CLOVE CREEK",183,4.91,1,1985,2140,5.42,"N","cyclical",0,"5","N","03","E",0.09,"6","Fair",5.5709999999999997,"2019-04-22",5.5709999999999997,"09",6,6,3.9285714285714306,7.5075000000000003,6.1049999999999969,"N",0,2.8420000000000005,1.9809999999999999,0.77500000000000002,0,0,4,1,"",null,13.526571428571431,0.18035428571428574]
["2224570","8","Ulster","40 - Town","40","BROAD ST HLW ROAD","BROAD ST HOLLW BK",187,4.91,99,1987,1375,5.6070000000000002,"N","cyclical",0,"4","N","09","1",7.0000000000000007E-2,"5","Fair",5.75,"2019-04-01",5.75,"09",5,5,7.8571428571428577,6.1599999999999966,17.16,"N",0,2.94,1.9809999999999999,13.5,0,0,3,"","",null,29.278142857142861,0.39037523809523816]
["2224600","8","Ulster","40 - Town","40","FAWN HILL ROAD","WOODLAND CREEK",32,4.91,99,1988,1520,3.5259999999999998,"Y","majorrehab",15,"4","N","09","1",0.52100000000000002,"4","Poor",3.86,"2019-08-20",3.86,"09",4,4,11.785714285714286,22.7425,24.75,"Y",5,0.81200000000000006,1.9809999999999999,13.5,2.9450000000000003,0,3,"",15,null,39.023714285714291,0.5203161904761906]
["2224620","8","Ulster","40 - Town","40","EAGLE MOUNTAIN RD","ESOPUS CREEK    ",2,4.91,99,1903,992,5.9809999999999999,"N","cyclical",20,"4","N","09","1",0.11700000000000001,"5","Fair",5.577,"2018-08-27",5.577,"09",5,5,7.8571428571428577,7.3975000000000009,17.16,"N",0,0.126,1.9809999999999999,13.5,1.3250000000000002,0,3,"",20,null,27.789142857142856,0.37052190476190477]
["2224650","8","Ulster","40 - Town","40","CHURCH ROAD     ","TRIB ESOPUS CREEK",8,4.91,10,1998,676,3.6669999999999998,"Y","majorrehab",0,"4","N","09","1",0.39200000000000002,"3","Poor",3.4289999999999998,"2019-06-06",3.4289999999999998,"09",3,3,15.714285714285715,25.135000000000002,27.06,"Y",5,0.25900000000000001,1.9809999999999999,10.5375,0,0,3,10,"",null,36.491785714285712,0.4865571428571428]
["2224670","8","Ulster","40 - Town","40","MOUNTAIN ROAD   ","BEAVER BROOK    ",192,4.91,2,1995,800,6.6669999999999998,"N","cyclical",0,"4","N","27","B",3.6999999999999998E-2,"7","Good",5.6360000000000001,"2018-04-02",5.6360000000000001,"09",5,5,7.8571428571428577,6.9574999999999996,17.16,"N",0,3.0380000000000003,1.9809999999999999,4.8125,0,0,3,2,"",null,20.68864285714286,0.27584857142857144]
["2224680","8","Ulster","40 - Town","40","RED MILLS ROAD  ","DWAAR KILL      ",1565,4.91,2,1963,800,4.4710000000000001,"N","minorrehab",0,"4","N","09","1",0.1,"5","Fair",4.2389999999999999,"2018-04-09",4.2389999999999999,"09",5,5,7.8571428571428577,19.112499999999997,17.16,"N",0,5.915,1.9809999999999999,4.8125,0,0,3,2,"",null,23.565642857142858,0.31420857142857145]
["2224690","8","Ulster","40 - Town","40","JOHNS ESTATE ROAD","VERKEERDER KILL ",579,4.91,1,2004,1140,5.8150000000000004,"N","cyclical",0,"4","N","27","B",3.6999999999999998E-2,"6","Fair",5.5449999999999999,"2018-04-04",5.5449999999999999,"09",5,5,7.8571428571428577,7.8649999999999984,17.16,"N",0,4.97,1.9809999999999999,0.77500000000000002,0,0,3,1,"",null,18.583142857142857,0.24777523809523808]
["2224700","8","Ulster","40 - Town","40","ULSTERVILLE ROAD","VERKEERDER KILL ",1419,4.91,2,1989,1144,4.9820000000000002,"N","cyclical",0,"2","N","36","1",6.7000000000000004E-2,"6","Fair",4.9119999999999999,"2018-05-18",4.9119999999999999,"09",5,5,7.8571428571428577,12.732499999999998,17.16,"N",0,5.7190000000000003,1.9809999999999999,4.8125,0,0,1,2,"",null,21.369642857142857,0.28492857142857142]
{"$rows_left_out":213}